{"text_format":"1","workbook":"xlsx","n_sheets":4,"sheets":["Gross Rev Wrksht","Instructions","FSA-1122","st_cty_dropdowns"],"not_rendered":{"charts":0,"images":3,"macros":1,"external_links":0,"defined_names":4,"comments":0,"pivot_tables":0},"unopened":[],"bounds":{"document_bytes":16777216,"sheet_cells":100000,"rows_first":2000,"rows_last":500,"rows_between":2000,"halvings":0,"cell_chars":16384,"cell_head_chars":4096},"cells_cut":0,"cells_raw":0,"read":"whole","date_system":"1900"}

{"sheet":"Gross Rev Wrksht","index":0,"n_rows":27,"n_cols":13,"rows_kept":27,"cut":false,"hidden":false,"merged":[[7,8,8,8],[9,4,9,8],[7,2,7,3],[28,3,28,4],[11,7,25,8],[1,1,1,8],[11,5,12,5],[11,6,12,6],[2,5,2,6],[2,2,2,3],[3,2,3,3],[4,2,4,3],[5,2,5,3],[6,2,6,3],[2,7,2,8],[3,4,4,7],[5,4,6,7],[7,4,8,7],[3,8,4,8],[8,1,9,3],[5,8,6,8]]}
[]
[null,"Gross Revenue Calculation Worksheet "]
[null,"Recording State:",null,null,"Recording County:",null,null,{"$f":"TODAY()","v":"2023-06-13"}]
[null,"Name:",null,null,"Are you a new producer who began farming in 2020 that doesn't have revenue in a prior year?",null,null,null,"No"]
[null,"Address 1:",null,null,null,null,null,null,null,null,null,"Yes"]
[null,"Address 2:",null,null,"Are you a new producer who began farming in 2019 that does NOT have a full year's revenue to report?",null,null,null,"No",null,null,"No"]
[null,"City, State and Zip Code:"]
[null,"Phone Number:",null,null,"Did your operation have increased operating capacity in 2020 compared to 2018 or 2019 that impacted revenue?",null,null,null,"No",null,null,{"$f":"IF(AND(L20=1,OR(I4=\"Yes\",I6=\"yes\",I8=\"yes\")),1,0)","v":0}]
[null,null,null,null,null,null,null,null,null,null,null,{"$f":"IF(I4=\"Yes\",E27,IF(D27=0,\"\",E27))","v":""}]
[null,null,null,null,{"$f":"IF(AND(OR(I4=\"yes\",I6=\"Yes\",I8=\"Yes\")),IF(SUM(C27:E27)=0,\"\",IF(L20=0,\"2020 Gross Revenue is Less than Prior Years.  If exceptions apply, complete the FSA-1122 & FSA-1122A.\",\"If the above exceptions apply, complete the FSA-1122 & FSA-1122A, as applicable\")),\"No adjustments allowed\")","v":"No adjustments allowed"}]
{"$rows_left_out":18}
{"sheet":"Instructions","index":1,"n_rows":26,"n_cols":3,"rows_kept":26,"cut":false,"hidden":false,"merged":[[15,1,15,2],[0,1,0,2],[2,1,2,2],[9,1,9,2],[11,1,11,2],[12,1,12,2]]}
[null,{"$f":"'Gross Rev Wrksht'!B2","v":"Gross Revenue Calculation Worksheet "}]
[null,"Data Field Name","Instructions"]
[null,"Information"]
[null,"Recording State","Use the drop down to select the producer’s recording state.\n\nNote:  This will be the same information entered into the FSA-1122 application software and FSA-1122 item 1.  "]
[null,"Recording County","Use the drop-down to select the producer’s recording county.\n\nNote:  This will be the same information entered into the FSA-1122 application software and FSA-1122 item 3.  "]
[null,"Name\nAddress 1\nAddress 2\nCity, State, and Zip Code\nPhone Number","Enter the producer’s name, address, city, state, zip code, and phone number, including area code.\n\nNote:  This will be the same information entered into the FSA-1122 application software and FSA-1122 item 5.  "]
[null,{"$f":"'Gross Rev Wrksht'!E4","v":"Are you a new producer who began farming in 2020 that doesn't have revenue in a prior year?"},"Use the drop down to select \"Yes\" or \"No\".  If \"Yes\", you may complete the Optional Worksheet to potentially adjust 2019 Revenue"]
[null,{"$f":"'Gross Rev Wrksht'!E6","v":"Are you a new producer who began farming in 2019 that does NOT have a full year's revenue to report?"},"Use the drop down to select \"Yes\" or \"No\".  If \"Yes\", you may complete the Optional Worksheet to potentially adjust 2019 Revenue"]
[null,{"$f":"'Gross Rev Wrksht'!E8","v":"Did your operation have increased operating capacity in 2020 compared to 2018 or 2019 that impacted revenue?"},"Use the drop down to select \"Yes\" or \"No\".  If \"Yes\", you may complete the Optional Worksheet to potentially adjust 2019 Revenue"]
[null,{"$f":"'Gross Rev Wrksht'!B2","v":"Gross Revenue Calculation Worksheet "}]
{"$rows_left_out":17}
{"sheet":"FSA-1122","index":2,"n_rows":49,"n_cols":24,"rows_kept":49,"cut":false,"hidden":false,"merged":[[17,3,17,23],[21,3,21,23],[41,22,41,23],[46,0,46,12],[47,0,47,12],[46,18,46,23],[46,13,46,17],[47,13,47,17],[41,17,41,21],[40,13,40,16],[41,4,41,8],[41,9,41,12],[41,13,41,16],[40,9,40,12],[38,22,38,23],[39,22,39,23],[40,22,40,23],[38,17,38,21],[39,17,39,21],[40,17,40,21],[38,13,38,16],[39,13,39,16],[38,0,38,3],[38,4,38,8],[38,9,38,12],[39,4,39,8],[39,9,39,12],[48,0,48,23],[18,3,18,23],[19,3,19,23],[20,3,20,23],[29,1,29,23],[47,18,47,22],[43,0,43,23],[44,0,44,10],[44,11,44,20],[44,21,44,23],[45,0,45,23],[42,0,42,23],[41,0,41,3],[39,0,39,3],[40,0,40,3],[40,4,40,8],[35,0,35,22],[36,0,36,17],[36,18,36,23],[37,0,37,12],[37,13,37,23],[34,0,34,22],[22,1,22,23],[23,1,23,23],[24,3,24,23],[25,3,25,23],[26,3,26,23],[27,3,27,23],[28,3,28,23],[30,1,30,23],[32,0,32,23],[33,0,33,23],[31,1,31,23],[13,1,13,23],[14,3,14,23],[15,3,15,23],[16,3,16,23],[7,1,7,23],[8,0,8,23],[9,0,9,23],[10,1,10,23],[11,1,11,23],[12,1,12,23],[4,1,6,10],[4,13,4,18],[4,19,4,23],[5,13,5,18],[5,19,5,23],[6,13,6,18],[6,19,6,23],[1,0,1,23],[2,0,2,12],[2,13,2,18],[2,19,2,23],[3,0,3,12],[3,13,3,18],[3,19,3,23]]}
[null,null,null,null,null,null,null,null,null,null,null,null,null,null,null,null,null,null,null,null,null,null,null,"Form Approved - OMB No. 0560-0312"]
["This form is available electronically.                                                                                                                        OMB  Expiration date 07/31/2023"]
["FSA-1122            U.S. DEPARTMENT OF AGRICULTURE",null,null,null,null,null,null,null,null,null,null,null,null,"1.   Recording State",null,null,null,null,null,"2.  Program Year"]
["(06-13-23)",null,null,null,null,null,null,null,null,null,null,null,null,{"$f":"IF('Gross Rev Wrksht'!C3=\"\",\"\",'Gross Rev Wrksht'!C3)","v":""},null,null,null,null,null,2020]
[null,"PANDEMIC ASSISTANCE REVENUE\nPROGRAM APPLICATION"]
[null,null,null,null,null,null,null,null,null,null,null,null,null,"3.  Recording County",null,null,null,null,null,"4. Application Number"]
[null,null,null,null,null,null,null,null,null,null,null,null,null,{"$f":"IF('Gross Rev Wrksht'!F3=\"\",\"\",'Gross Rev Wrksht'!F3)","v":""}]
["NOTE:","The following statement is made in accordance with the Privacy Act of 1974 (5 USC 552a - as amended). The authority for requesting the information identified on this form is  7 CFR Part 9, and the Consolidated Appropriations Act (Pub. L 116-260).  The information will be used to determine eligibility for program benefits.  The information collected on this form may be disclosed to other Federal, State, and Local government agencies, Tribal agencies, and nongovernmental entities that have been authorized access to the information by statute or regulation and/or as described in applicable Routine Uses identified in the System of Records Notice for USDA/FSA-2, Farm Records File (Automated).  Providing the requested information is voluntary.  However, failure to furnish the requested information will result in a determination of ineligibility for program benefits.  Payments may be made under the program to which the form applies only to the extent permitted by applicable authorities. \n\nPublic Burden Statement (Paperwork Reduction Act):  Public reporting burden for this collection is estimated to average 60 minutes per response, including reviewing instructions, gathering and maintaining the data needed, completing (providing the information), and reviewing the collection of information. You are not required to respond to the collection, or USDA may not conduct or sponsor a collection of information unless it displays a valid OMB control number.  RETURN THIS COMPLETED FORM TO LOCAL USDA-FARM SERVICE AGENCY OFFICE. "]
["PART A – PRODUCER AGREEMENT"]
["The Department of Agriculture (USDA) will make PARP payments to producers who meet the requirements of the program. The following information is needed for USDA to make a determination that the applicant is eligible to receive a PARP payment. By submitting this application, and upon approval by USDA, the applicant agrees:"]
{"$rows_left_out":40}
{"sheet":"st_cty_dropdowns","index":3,"n_rows":255,"n_cols":58,"rows_kept":255,"cut":false,"hidden":true,"merged":[]}
[" ","Alabama (01)","Alaska (02)","Arizona (04)","Arkansas (05)","California (06)","Colorado (08)","Connecticut (09)","Delaware (10)","District of Columbia (11)","Florida (12)","Georgia (13)","Guam (14)","Hawaii (15)","Idaho (16)","Illinois (17)","Indiana (18)","Iowa (19)","Kansas (20)","Kentucky (21)","Louisiana (22)","Maine (23)","Maryland (24)","Massachusetts (25)","Michigan (26)","Minnesota (27)","Mississippi (28)","Missouri (29)","Montana (30)","Nebraska (31)","Nevada (32)","New Hampshire (33)","New Jersey (34)","New Mexico (35)","New York (36)","North Carolina (37)","North Dakota (38)","Ohio (39)","Oklahoma (40)","Oregon (41)","Pennsylvania (42)","Rhode Island (44)","South Carolina (45)","South Dakota (46)","Tennessee (47)","Texas (48)","Utah (49)","Vermont (50)","Virginia (51)","Virgin Islands of the U.S. (52)","Washington (53)","West Virginia (54)","Wisconsin (55)","Wyoming (56)","American Samoa (60)","Federated States of Micronesia (64)","Northern Mariana Islands (69)","Puerto Rico (72)"]
[null,"Autauga (001)","Fairbanks (001)","Apache (001)","Arkansas (001)","Alameda (001)","Adams (001)","Fairfield (001)","Kent (001)","District of Columbia (001)","Alachua (001)","Appling (001)","Guam (001)","Hawaii (001)","Ada (001)","Adams (001)","Adams (001)","Adair (001)","Allen (001)","Adair (001)","Acadia (001)","Androscoggin (001)","Allegany (001)","Barnstable (001)","Alcona (001)","Aitkin (001)","Adams (001)","Adair (001)","Beaverhead (001)","Adams (001)","Churchill (001)","Belknap (001)","Atlantic (001)","Bernalillo (001)","Albany (001)","Alamance (001)","Adams (001)","Adams (001)","Adair (001)","Baker (001)","Adams (001)","Bristol (001)","Abbeville (001)","Aurora (003)","Anderson (001)","Anderson (001)","Beaver (001)","Addison (001)","Accomack (001)","St. Croix (001)","Adams (001)","Barbour (001)","Adams (001)","Albany (001)","American Samoa (001)","Pohnpei (040)","Rota (100)","Adjuntas (001)"]
[null,"Baldwin (003)","Delta (002)","Cochise (003)","Ashley (003)","Alpine (003)","Alamosa (003)","Hartford (003)","New Castle (003)",null,"Baker (003)","Atkinson (003)",null,"Honolulu (003)","Adams (003)","Alexander (003)","Allen (003)","Adams (003)","Anderson (003)","Allen (003)","Allen (003)","Houlton (002)","Anne Arundel (003)","Berkshire (003)","Alger (003)","Anoka (003)","Alcorn (003)","Andrew (003)","Big Horn (003)","Antelope (003)","Clark (003)","Carroll (003)","Burlington (005)","Catron (003)","Allegany (003)","Alexander (003)","Barnes (003)","Allen (003)","Alfalfa (003)","Benton (003)","Allegheny (003)","Kent (003)","Aiken (003)","Beadle (005)","Bedford (003)","Andrews (003)","Box Elder (003)","Bennington (003)","Albemarle, Charlottesville City (003)","St. John (003)","Asotin (003)","Berkeley (003)","Ashland (003)","Big Horn (003)",null,null,"Saipan (110)","Arecibo (013)"]
[null,"Barbour (005)","Homer (003)","Coconino (005)","Baxter (005)","Amador (005)","Arapahoe (005)","Litchfield (005)","Sussex (005)",null,"Bay (005)","Bacon (005)",null,"Kalawao (005)","Bannock (005)","Bond (005)","Bartholomew (005)","Allamakee (005)","Atchison (005)","Anderson (005)","Ascension (005)","Aroostook (003)","Baltimore (005)","Bristol (005)","Allegan (005)","Becker (005)","Amite (005)","Atchison (005)","Blaine (005)","Arthur (005)","Douglas (005)","Cheshire (005)","Camden (007)","Chaves (005)","Bronx (005)","Alleghany (005)","Benson (005)","Ashland (005)","Atoka (005)","Clackamas (005)","Armstrong (005)","Newport (005)","Allendale (005)","Bennett (007)","Benton (005)","Angelina (005)","Cache (005)","Caledonia (005)","Alleghany, Covington City (005)","St. Thomas (005)","Benton (005)","Boone (005)","Barron (005)","Campbell (005)",null,null,"Tinian (120)","Barranquitas (019)"]
[null,"Bibb (007)","Palmer (005)","Gila (007)","Benton (007)","Butte (007)","Archuleta (007)","Middlesex (007)",null,null,"Bradford (007)","Baker (007)",null,"Kauai (007)","Bear Lake (007)","Boone (007)","Benton (007)","Appanoose (007)","Barber (007)","Ballard (007)","Assumption (007)","Fort Kent (004)","Calvert (009)","Dukes (007)","Alpena (007)","Beltrami (007)","Attala (007)","Audrain (007)","Broadwater (007)","Banner (007)","Elko (007)","Coos (007)","Cape May (009)","Cibola (006)","Broome (007)","Anson (007)","Billings (007)","Ashtabula (007)","Beaver (007)","Clatsop (007)","Beaver (007)","Providence (007)","Anderson (007)","Bon Homme (009)","Bledsoe (007)","Aransas (007)","Carbon (007)","Chittenden (007)","Amelia (007)",null,"Chelan (007)","Braxton (007)","Bayfield (007)","Carbon (007)",null,null,null,"Caguas (025)"]
[null,"Blount (009)",null,"Graham (009)","Boone (009)","Calaveras (009)","Baca (009)","New Haven (009)",null,null,"Brevard (009)","Baldwin (009)",null,"Maui (009)","Benewah, South Shoshone (009)","Brown (009)","Blackford (009)","Audubon (009)","Barton (009)","Barren (009)","Avoyelles (009)","Cumberland (005)","Caroline (011)","Essex (009)","Antrim (009)","Benton (009)","Benton (009)","Barry (009)","Carbon (009)","Blaine (009)","Esmeralda (009)","Grafton (009)","Cumberland (011)","Colfax (007)","Cattaraugus (009)","Ashe (009)","Bottineau (009)","Athens (009)","Beckham (009)","Columbia (009)","Bedford (009)","Washington (009)","Bamberg (009)","Brookings (011)","Blount (009)","Archer (009)","Daggett (009)","Essex (009)","Amherst (009)",null,"Clallam (009)","Brooke (009)","Brown (009)","Converse (009)",null,null,null,"Corozal (047)"]
[null,"Bullock (011)",null,"Greenlee (011)","Bradley (011)","Colusa (011)","Bent (011)","New London (011)",null,null,"Broward (011)","Banks (011)",null,null,"Bingham (011)","Bureau (011)","Boone (011)","Benton (011)","Bourbon (011)","Bath (011)","Beauregard (011)","Franklin (007)","Carroll (013)","Franklin (011)","Arenac (011)","Big Stone (011)","Bolivar (011)","Barton (011)","Carter (011)","Boone (011)","Eureka (011)","Hillsborough (011)","Gloucester (015)","Curry (009)","Cayuga (011)","Avery (011)","Bowman (011)","Auglaize (011)","Blaine (011)","Coos (011)","Berks (011)",null,"Barnwell (011)","Brown (013)","Bradley (011)","Armstrong (011)","Davis (011)","Franklin (011)","Appomattox (011)",null,"Clark (011)","Cabell (011)","Buffalo (011)","Crook (011)",null,null,null,"Lares (081)"]
[null,"Butler (013)",null,"La Paz (012)","Calhoun (013)","Contra Costa (013)","Boulder (013)","Tolland (013)",null,null,"Calhoun (013)","Barrow (013)",null,null,"Blaine (013)","Calhoun (013)","Brown (013)","Black Hawk (013)","Brown (013)","Bell (013)","Bienville (013)","Hancock (009)","Cecil (015)","Hampden (013)","Baraga (013)","Blue Earth (013)","Calhoun (013)","Bates (013)","Cascade (013)","Box Butte (013)","Humboldt (013)","Merrimack (013)","Hunterdon (019)","De Baca (011)","Chautauqua (013)","Beaufort (013)","Burke (013)","Belmont (013)","Bryan (013)","Crook (013)","Blair (013)",null,"Beaufort (013)","Brule (015)","Campbell (013)","Atascosa (013)","Duchesne (013)","Grand Isle (013)","Arlington (013)",null,"Columbia (013)","Calhoun (013)","Burnett (013)","Fremont (013)",null,null,null,"Mayaguez (097)"]
[null,"Calhoun (015)",null,"Maricopa (013)","Carroll (015)","Del Norte (015)","Broomfield (014)","Windham (015)",null,null,"Charlotte (015)","Bartow (015)",null,null,"Boise (015)","Carroll (015)","Carroll (015)","Boone (015)","Butler (015)","Boone (015)","Bossier (015)","Kennebec (011)","Charles (017)","Hampshire (015)","Barry (015)","Brown (015)","Carroll (015)","Benton (015)","Chouteau (015)","Boyd (015)","Lander (015)","Rockingham (015)","Mercer (021)","Dona Ana (013)","Chemung (015)","Bertie (015)","Burleigh (015)","Brown (015)","Caddo (015)","Curry (015)","Bradford (015)",null,"Berkeley (015)","Buffalo (017)","Cannon (015)","Austin (015)","Emery (015)","Lamoille (015)","Augusta (015)",null,"Cowlitz (015)","Clay (015)","Calumet (015)","Goshen (015)",null,null,null,"Ponce (113)"]
[null,"Chambers (017)",null,"Mohave (015)","Chicot (017)","El Dorado (017)","Chaffee (015)",null,null,null,"Citrus (017)","Ben Hill (017)",null,null,"Bonner (017)","Cass (017)","Cass (017)","Bremer (017)","Chase (017)","Bourbon (017)","Caddo (017)","Knox (013)","Dorchester (019)","Middlesex (017)","Bay (017)","Carlton (017)","Chickasaw (017)","Bollinger (017)","Custer (017)","Brown (017)","Lincoln (017)","Strafford (017)","Middlesex (023)","Eddy (015)","Chenango (017)","Bladen (017)","Cass (017)","Butler (017)","Canadian (017)","Deschutes (017)","Bucks (017)",null,"Calhoun (017)","Butte (019)","Carroll (017)","Bailey (017)","Garfield (017)","Orange (017)","Bath (017)",null,"Douglas (017)","Doddridge (017)","Chippewa (017)","Hot Springs (017)",null,null,null,"Utuado (141)"]
{"$rows_left_out":245}